Reaction Details
TargetMelanin-concentrating hormone receptor 1
LigandBDBM50301708
Substrate/Competitorn/a
Meas. Tech.ChEMBL_597870 (CHEMBL1039133)
IC50 12±n/a nM
Citation Suzuki, TKameda, MAndo, MMiyazoe, HSekino, EIto, SMasutani, KKamijo, KTakezawa, AMoriya, MIto, MIto, JNakase, KMatsushita, HIshihara, ATakenaga, NTokita, SKanatani, ASato, NFukami, T Discovery of novel diarylketoxime derivatives as selective and orally active melanin-concentrating hormone 1 receptor antagonists. Bioorg Med Chem Lett19:5339-45 (2009) 
 
Melanin-concentrating hormone receptor 1
Name:Melanin-concentrating hormone receptor 1
Type:PROTEIN
Mol. Mass.:39133.74
Organism:Mus musculus
Description:ChEMBL_818502
Residue:353
BDBM50301708
NameBDBM50301708
Synonyms:(Z)-1'-((6-((3,4-difluorophenyl)(ethoxyimino)methyl)pyridin-3-yl)methyl)-5-methyl-3H-spiro[furo[3,4-c]pyridine-1,4'-piperidin]-6(5H)-one | CHEMBL585664
TypeSmall organic molecule
Emp. Form.C27H28F2N4O3
Mol. Mass.494.533
SMILESCCO\N=C(\c1ccc(F)c(F)c1)c1ccc(CN2CCC3(CC2)OCc2cn(C)c(=O)cc32)cn1