Reaction Details
TargetDNA gyrase subunit B
LigandBDBM50378420
Substrate/Competitorn/a
Meas. Tech.ChEMBL_598030 (CHEMBL1046299)
IC50 51±n/a nM
Citation Starr, JTSciotti, RJHanna, DLHuband, MDMullins, LMCai, HGage, JWLockard, MRauckhorst, MROwen, RMLall, MSTomilo, MChen, HMcCurdy, SPBarbachyn, MR 5-(2-Pyrimidinyl)-imidazo[1,2-a]pyridines are antibacterial agents targeting the ATPase domains of DNA gyrase and topoisomerase IV. Bioorg Med Chem Lett19:5302-6 (2009) 
 
DNA gyrase subunit B
Name:DNA gyrase subunit B
Type:PROTEIN
Mol. Mass.:72222.52
Organism:Streptococcus pneumoniae
Description:ChEMBL_598030
Residue:648
BDBM50378420
NameBDBM50378420
Synonyms:CHEMBL565750
TypeSmall organic molecule
Emp. Form.C22H23N7O2
Mol. Mass.417.4637
SMILESCCNC(=O)Nc1cn2c(cc(cc2n1)-c1ccn(CC)c(=O)c1)-c1ncc(C)cn1