Reaction Details
TargetDNA gyrase subunit B
LigandBDBM50378438
Substrate/Competitorn/a
Meas. Tech.ChEMBL_598030 (CHEMBL1046299)
IC50 92±n/a nM
Citation Starr, JTSciotti, RJHanna, DLHuband, MDMullins, LMCai, HGage, JWLockard, MRauckhorst, MROwen, RMLall, MSTomilo, MChen, HMcCurdy, SPBarbachyn, MR 5-(2-Pyrimidinyl)-imidazo[1,2-a]pyridines are antibacterial agents targeting the ATPase domains of DNA gyrase and topoisomerase IV. Bioorg Med Chem Lett19:5302-6 (2009) 
 
DNA gyrase subunit B
Name:DNA gyrase subunit B
Type:PROTEIN
Mol. Mass.:72222.52
Organism:Streptococcus pneumoniae
Description:ChEMBL_598030
Residue:648
BDBM50378438
NameBDBM50378438
Synonyms:CHEMBL577053
TypeSmall organic molecule
Emp. Form.C19H17N7O
Mol. Mass.359.3846
SMILESCNC(=O)Nc1cn2c(cc(cc2n1)-c1cccnc1)-c1ncc(C)cn1