Reaction Details
TargetDNA topoisomerase (ATP-hydrolyzing)
LigandBDBM50378443
Substrate/Competitorn/a
Meas. Tech.ChEMBL_598031 (CHEMBL1046300)
IC50 119±n/a nM
Citation Starr, JTSciotti, RJHanna, DLHuband, MDMullins, LMCai, HGage, JWLockard, MRauckhorst, MROwen, RMLall, MSTomilo, MChen, HMcCurdy, SPBarbachyn, MR 5-(2-Pyrimidinyl)-imidazo[1,2-a]pyridines are antibacterial agents targeting the ATPase domains of DNA gyrase and topoisomerase IV. Bioorg Med Chem Lett19:5302-6 (2009) 
 
DNA topoisomerase (ATP-hydrolyzing)
Name:DNA topoisomerase (ATP-hydrolyzing)
Synonyms:ParE
Type:PROTEIN
Mol. Mass.:70593.66
Organism:Streptococcus pneumoniae
Description:ChEMBL_598031
Residue:638
BDBM50378443
NameBDBM50378443
Synonyms:CHEMBL568020
TypeSmall organic molecule
Emp. Form.C20H19N7O
Mol. Mass.373.4112
SMILESCCNC(=O)Nc1cn2c(cc(cc2n1)-c1ccc(C)nc1)-c1ncccn1