Reaction Details
TargetCytochrome P450 2D6
LigandBDBM50302042
Substrate/Competitorn/a
Meas. Tech.ChEMBL_599152 (CHEMBL1047207)
IC50>10000±n/a nM
Citation Prashad, ASWang, DSubrath, JWu, BLin, MZhang, MYKagan, NLee, JYang, XBrennan, AChaudhary, DXu, XLeung, LWang, JBoschelli, DH C-5 substituted heteroaryl-3-pyridinecarbonitriles as PKCtheta inhibitors: part II. Bioorg Med Chem Lett19:5799-802 (2009) 
 
Cytochrome P450 2D6
Name:Cytochrome P450 2D6
Type:Protein
Mol. Mass.:55774.82
Organism:Homo sapiens (Human)
Description:P10635
Residue:497
BDBM50302042
NameBDBM50302042
Synonyms:4-(4-methyl-1H-indol-5-ylamino)-5-(5-((4-methylpiperazin-1-yl)methyl)benzofuran-2-yl)nicotinonitrile | CHEMBL571581
TypeSmall organic molecule
Emp. Form.C29H28N6O
Mol. Mass.476.5722
SMILESCN1CCN(Cc2ccc3oc(cc3c2)-c2cncc(C#N)c2Nc2ccc3[nH]ccc3c2C)CC1