Reaction Details
TargetProtein kinase C delta type
LigandBDBM50302043
Substrate/Competitorn/a
Meas. Tech.ChEMBL_599129 (CHEMBL1047184)
IC50 57±n/a nM
Citation Prashad, ASWang, DSubrath, JWu, BLin, MZhang, MYKagan, NLee, JYang, XBrennan, AChaudhary, DXu, XLeung, LWang, JBoschelli, DH C-5 substituted heteroaryl-3-pyridinecarbonitriles as PKCtheta inhibitors: part II. Bioorg Med Chem Lett19:5799-802 (2009) 
 
Protein kinase C delta type
Name:Protein kinase C delta type
Type:Enzyme
Mol. Mass.:77516.79
Organism:Homo sapiens (Human)
Description:The recombinant human PKC enzymes were produced using a baculovirus expression system in SF9 cells
Residue:676
BDBM50302043
NameBDBM50302043
Synonyms:5-(benzofuran-2-yl)-4-(4-methyl-1H-indol-5-ylamino)nicotinonitrile | CHEMBL570247
TypeSmall organic molecule
Emp. Form.C23H16N4O
Mol. Mass.364.3993
SMILESCc1c(Nc2c(cncc2-c2cc3ccccc3o2)C#N)ccc2[nH]ccc12