Reaction Details
TargetProtein kinase C delta type
LigandBDBM50302051
Substrate/Competitorn/a
Meas. Tech.ChEMBL_599129 (CHEMBL1047184)
IC50 10±n/a nM
Citation Prashad, ASWang, DSubrath, JWu, BLin, MZhang, MYKagan, NLee, JYang, XBrennan, AChaudhary, DXu, XLeung, LWang, JBoschelli, DH C-5 substituted heteroaryl-3-pyridinecarbonitriles as PKCtheta inhibitors: part II. Bioorg Med Chem Lett19:5799-802 (2009) 
 
Protein kinase C delta type
Name:Protein kinase C delta type
Type:Enzyme
Mol. Mass.:77516.79
Organism:Homo sapiens (Human)
Description:The recombinant human PKC enzymes were produced using a baculovirus expression system in SF9 cells
Residue:676
BDBM50302051
NameBDBM50302051
Synonyms:5-(5-((cyclohexylamino)methyl)benzofuran-2-yl)-4-(4-methyl-1H-indol-5-ylamino)nicotinonitrile | CHEMBL569590
TypeSmall organic molecule
Emp. Form.C30H29N5O
Mol. Mass.475.5842
SMILESCc1c(Nc2c(cncc2-c2cc3cc(CNC4CCCCC4)ccc3o2)C#N)ccc2[nH]ccc12