Reaction Details
TargetProtein kinase C delta type
LigandBDBM50302036
Substrate/Competitorn/a
Meas. Tech.ChEMBL_599129 (CHEMBL1047184)
IC50 16±n/a nM
Citation Prashad, ASWang, DSubrath, JWu, BLin, MZhang, MYKagan, NLee, JYang, XBrennan, AChaudhary, DXu, XLeung, LWang, JBoschelli, DH C-5 substituted heteroaryl-3-pyridinecarbonitriles as PKCtheta inhibitors: part II. Bioorg Med Chem Lett19:5799-802 (2009) 
 
Protein kinase C delta type
Name:Protein kinase C delta type
Type:Enzyme
Mol. Mass.:77516.79
Organism:Homo sapiens (Human)
Description:The recombinant human PKC enzymes were produced using a baculovirus expression system in SF9 cells
Residue:676
BDBM50302036
NameBDBM50302036
Synonyms:5-(5-((4-ethylpiperazin-1-yl)methyl)benzofuran-2-yl)-4-(4-methyl-1H-indol-5-ylamino)nicotinonitrile | CHEMBL570713
TypeSmall organic molecule
Emp. Form.C30H30N6O
Mol. Mass.490.5988
SMILESCCN1CCN(Cc2ccc3oc(cc3c2)-c2cncc(C#N)c2Nc2ccc3[nH]ccc3c2C)CC1