Reaction Details
TargetProtein kinase C theta type
LigandBDBM50302039
Substrate/Competitorn/a
Meas. Tech.ChEMBL_599128 (CHEMBL1047183)
IC50 13±n/a nM
Citation Prashad, ASWang, DSubrath, JWu, BLin, MZhang, MYKagan, NLee, JYang, XBrennan, AChaudhary, DXu, XLeung, LWang, JBoschelli, DH C-5 substituted heteroaryl-3-pyridinecarbonitriles as PKCtheta inhibitors: part II. Bioorg Med Chem Lett19:5799-802 (2009) 
 
Protein kinase C theta type
Name:Protein kinase C theta type
Type:Serine/threonine-protein kinase
Mol. Mass.:81878.04
Organism:Homo sapiens (Human)
Description:Full-length human PKC theta (Panvera Catalog No. P2996).
Residue:706
BDBM50302039
NameBDBM50302039
Synonyms:4-(4-methyl-1H-indol-5-ylamino)-5-(5-((4-(pyridin-2-yl)piperazin-1-yl)methyl)benzofuran-2-yl)nicotinonitrile | CHEMBL571281
TypeSmall organic molecule
Emp. Form.C33H29N7O
Mol. Mass.539.6297
SMILESCc1c(Nc2c(cncc2-c2cc3cc(CN4CCN(CC4)c4ccccn4)ccc3o2)C#N)ccc2[nH]ccc12