Reaction Details
TargetProtein kinase C delta type
LigandBDBM50302039
Substrate/Competitorn/a
Meas. Tech.ChEMBL_599129 (CHEMBL1047184)
IC50 149±n/a nM
Citation Prashad, ASWang, DSubrath, JWu, BLin, MZhang, MYKagan, NLee, JYang, XBrennan, AChaudhary, DXu, XLeung, LWang, JBoschelli, DH C-5 substituted heteroaryl-3-pyridinecarbonitriles as PKCtheta inhibitors: part II. Bioorg Med Chem Lett19:5799-802 (2009) 
 
Protein kinase C delta type
Name:Protein kinase C delta type
Type:Enzyme
Mol. Mass.:77516.79
Organism:Homo sapiens (Human)
Description:The recombinant human PKC enzymes were produced using a baculovirus expression system in SF9 cells
Residue:676
BDBM50302039
NameBDBM50302039
Synonyms:4-(4-methyl-1H-indol-5-ylamino)-5-(5-((4-(pyridin-2-yl)piperazin-1-yl)methyl)benzofuran-2-yl)nicotinonitrile | CHEMBL571281
TypeSmall organic molecule
Emp. Form.C33H29N7O
Mol. Mass.539.6297
SMILESCc1c(Nc2c(cncc2-c2cc3cc(CN4CCN(CC4)c4ccccn4)ccc3o2)C#N)ccc2[nH]ccc12