Reaction Details
TargetHistone deacetylase 6
LigandBDBM50302072
Substrate/Competitorn/a
Meas. Tech.ChEMBL_599174 (CHEMBL1049817)
IC50 39±n/a nM
Citation Olsen, CAGhadiri, MR Discovery of potent and selective histone deacetylase inhibitors via focused combinatorial libraries of cyclic alpha3beta-tetrapeptides. J Med Chem52:7836-46 (2009) 
 
Histone deacetylase 6
Name:Histone deacetylase 6
Type:Chromatin regulator; hydrolase; repressor
Mol. Mass.:131381.51
Organism:Homo sapiens (Human)
Description:Q9UBN7
Residue:1215
BDBM50302072
NameBDBM50302072
Synonyms:2-((3S,6S,9S,13S)-9-(3-guanidinopropyl)-6-(6-(hydroxyamino)-6-oxohexyl)-13-(4-hydroxybenzyl)-2,5,8,11-tetraoxo-1,4,7,10-tetraazacyclotridecan-3-yl)acetic acid | CHEMBL568151
TypeSmall organic molecule
Emp. Form.C28H42N8O9
Mol. Mass.634.6813
SMILES[#7]\[#6](-[#7])=[#7]\[#6]-[#6]-[#6]-[#6@@H]-1-[#7]-[#6](=O)-[#6]-[#6@H](-[#6]-c2ccc(-[#8])cc2)-[#7]-[#6](=O)-[#6@H](-[#6]-[#6](-[#8])=O)-[#7]-[#6](=O)-[#6@H](-[#6]-[#6]-[#6]-[#6]-[#6]-[#6](=O)-[#7]-[#8])-[#7]-[#6]-1=O