Reaction Details
TargetTryptase gamma
LigandBDBM50302107
Substrate/Competitorn/a
Meas. Tech.ChEMBL_600089 (CHEMBL1041954)
IC50 10000±n/a nM
Citation Kwan, JCEksioglu, EALiu, CPaul, VJLuesch, H Grassystatins A-C from marine cyanobacteria, potent cathepsin E inhibitors that reduce antigen presentation. J Med Chem52:5732-47 (2009) 
 
Tryptase gamma
Name:Tryptase gamma
Type:PROTEIN
Mol. Mass.:33817.52
Organism:Homo sapiens (Human)
Description:ChEMBL_210833
Residue:321
BDBM50302107
NameBDBM50302107
Synonyms:CHEMBL567893 | Grassystatin A
TypeSmall organic molecule
Emp. Form.C58H95N9O16
Mol. Mass.1174.4256
SMILESCOC(=O)[C@@H]1CCCN1C(=O)[C@@H](Cc1ccccc1)N(C)C(=O)[C@H](C)NC(=O)[C@@H](NC(=O)C[C@H](O)[C@H](CC(C)C)NC(=O)[C@H](CC(N)=O)NC(=O)[C@H](CC(C)C)NC(=O)[C@H](OC(=O)[C@@H](OC(=O)[C@H](C(C)C)N(C)C)C(C)C)C(C)C)[C@@H](C)O