Reaction Details
TargetEphrin type-A receptor 3
LigandBDBM50302166
Substrate/Competitorn/a
Meas. Tech.ChEMBL_599561 (CHEMBL1038371)
IC50>7000±n/a nM
Citation Wu, JPFleck, RBrickwood, JCapolino, ACatron, KChen, ZCywin, CEmeigh, JFoerst, MGinn, JHrapchak, MHickey, EHao, MHKashem, MLi, JLiu, WMorwick, TNelson, RMarshall, DMartin, LNemoto, PPotocki, ILiuzzi, MPeet, GWScouten, EStefany, DTurner, MWeldon, SZimmitti, CSpero, DKelly, TA The discovery of thienopyridine analogues as potent IkappaB kinase beta inhibitors. Part II. Bioorg Med Chem Lett19:5547-51 (2009) 
 
Ephrin type-A receptor 3
Name:Ephrin type-A receptor 3
Type:Protein
Mol. Mass.:110131.95
Organism:Homo sapiens (Human)
Description:P29320
Residue:983
BDBM50302166
NameBDBM50302166
Synonyms:3-amino-6-(3-hydroxypiperidin-1-yl)-4-propylthieno[2,3-b]pyridine-2-carboxamide | CHEMBL576989
TypeSmall organic molecule
Emp. Form.C16H22N4O2S
Mol. Mass.334.436
SMILESCCCc1cc(nc2sc(C(N)=O)c(N)c12)N1CCCC(O)C1