Reaction Details
TargetInhibitor of nuclear factor kappa-B kinase subunit beta
LigandBDBM50302165
Substrate/Competitorn/a
Meas. Tech.ChEMBL_598905 (CHEMBL1047281)
IC50 280±n/a nM
Citation Wu, JPFleck, RBrickwood, JCapolino, ACatron, KChen, ZCywin, CEmeigh, JFoerst, MGinn, JHrapchak, MHickey, EHao, MHKashem, MLi, JLiu, WMorwick, TNelson, RMarshall, DMartin, LNemoto, PPotocki, ILiuzzi, MPeet, GWScouten, EStefany, DTurner, MWeldon, SZimmitti, CSpero, DKelly, TA The discovery of thienopyridine analogues as potent IkappaB kinase beta inhibitors. Part II. Bioorg Med Chem Lett19:5547-51 (2009) 
 
Inhibitor of nuclear factor kappa-B kinase subunit beta
Name:Inhibitor of nuclear factor kappa-B kinase subunit beta
Type:Serine/threonine-protein kinase
Mol. Mass.:86554.39
Organism:Homo sapiens (Human)
Description:GST-tagged IKK-2 was expressed in High Five cells and purified.
Residue:756
BDBM50302165
NameBDBM50302165
Synonyms:3-amino-6-(4-hydroxypiperidin-1-yl)-4-propylthieno[2,3-b]pyridine-2-carboxamide | CHEMBL576887
TypeSmall organic molecule
Emp. Form.C16H22N4O2S
Mol. Mass.334.436
SMILESCCCc1cc(nc2sc(C(N)=O)c(N)c12)N1CCC(O)CC1