Reaction Details
Target5-hydroxytryptamine receptor 2A
LigandBDBM50302213
Substrate/Competitorn/a
Meas. Tech.ChEMBL_599591 (CHEMBL1040203)
Ki 2±n/a nM
Citation Rotella, DPMcFarlane, GRGreenfield, AGrosanu, CRobichaud, AJDenny, RAFeenstra, RWNúñez-García, SReinders, JHNeut, MvMcCreary, AKruse, CGSullivan, KPruthi, FLai, MZhang, JKowal, DMCarrick, TGrauer, SMNavarra, RLGraf, RBrennan, JMarquis, KLPausch, MH Tetrahydrocarbazole-based serotonin reuptake inhibitor/dopamine D2 partial agonists for the potential treatment of schizophrenia. Bioorg Med Chem Lett19:5552-5 (2009) 
 
5-hydroxytryptamine receptor 2A
Name:5-hydroxytryptamine receptor 2A
Type:undefined
Mol. Mass.:52607.65
Organism:Homo sapiens (Human)
Description:P28223
Residue:471
BDBM50302213
NameBDBM50302213
Synonyms:(3S)-3-(((6-fluoro-2,3,4,9-tetrahydro-1H-carbazol-3-yl)methylamino)methyl)-7,9-dihydro-2H-[1,4]dioxino[2,3-e]indol-8(3H)-one | CHEMBL569251
TypeSmall organic molecule
Emp. Form.C24H24FN3O3
Mol. Mass.421.4641
SMILESFc1ccc2[nH]c3CCC(CNC[C@H]4COc5c6CC(=O)Nc6ccc5O4)Cc3c2c1