Reaction Details
TargetSodium/glucose cotransporter 2
LigandBDBM50302621
Substrate/Competitorn/a
Meas. Tech.ChEMBL_594779 (CHEMBL1040740)
IC50 100±n/a nM
Citation Goodwin, NCMabon, RHarrison, BAShadoan, MKAlmstead, ZYXie, YHealy, JBuhring, LMDaCosta, CMBardenhagen, JMseeh, FLiu, QNouraldeen, AWilson, AGKimball, SDPowell, DRRawlins, DB Novel L-xylose derivatives as selective sodium-dependent glucose cotransporter 2 (SGLT2) inhibitors for the treatment of type 2 diabetes. J Med Chem52:6201-4 (2009) 
 
Sodium/glucose cotransporter 2
Name:Sodium/glucose cotransporter 2
Type:Protein
Mol. Mass.:73014.31
Organism:Mus musculus (Mouse)
Description:Q923I7
Residue:670
BDBM50302621
NameBDBM50302621
Synonyms:(2S,3R,4R,5S)-2-(4-Chloro-3-(4-methoxyphenylthio)phenyl)-6-methoxytetrahydro-2H-pyran-3,4,5-triol | CHEMBL577519
TypeSmall organic molecule
Emp. Form.C19H21ClO6S
Mol. Mass.412.884
SMILESCOC1O[C@H]([C@H](O)[C@@H](O)[C@@H]1O)c1ccc(Cl)c(Sc2ccc(OC)cc2)c1