Reaction Details
TargetSodium/glucose cotransporter 2
LigandBDBM50302613
Substrate/Competitorn/a
Meas. Tech.ChEMBL_594780 (CHEMBL1040741)
IC50 150±n/a nM
Citation Goodwin, NCMabon, RHarrison, BAShadoan, MKAlmstead, ZYXie, YHealy, JBuhring, LMDaCosta, CMBardenhagen, JMseeh, FLiu, QNouraldeen, AWilson, AGKimball, SDPowell, DRRawlins, DB Novel L-xylose derivatives as selective sodium-dependent glucose cotransporter 2 (SGLT2) inhibitors for the treatment of type 2 diabetes. J Med Chem52:6201-4 (2009) 
 
Sodium/glucose cotransporter 2
Name:Sodium/glucose cotransporter 2
Type:Protein
Mol. Mass.:72902.00
Organism:Homo sapiens (Human)
Description:P31639
Residue:672
BDBM50302613
NameBDBM50302613
Synonyms:(2S,3R,4R,5S)-2-(4-Chloro-3-(4-(thiazol-2-yloxy)benzyl)phenyl)-6-methoxytetrahydro-2Hpyran-3,4,5-triol | CHEMBL566076
TypeSmall organic molecule
Emp. Form.C22H22ClNO6S
Mol. Mass.463.931
SMILESCOC1O[C@H]([C@H](O)[C@@H](O)[C@@H]1O)c1ccc(Cl)c(Cc2ccc(Oc3nccs3)cc2)c1