Reaction Details
TargetSodium/glucose cotransporter 2
LigandBDBM50302614
Substrate/Competitorn/a
Meas. Tech.ChEMBL_594780 (CHEMBL1040741)
IC50 170±n/a nM
Citation Goodwin, NCMabon, RHarrison, BAShadoan, MKAlmstead, ZYXie, YHealy, JBuhring, LMDaCosta, CMBardenhagen, JMseeh, FLiu, QNouraldeen, AWilson, AGKimball, SDPowell, DRRawlins, DB Novel L-xylose derivatives as selective sodium-dependent glucose cotransporter 2 (SGLT2) inhibitors for the treatment of type 2 diabetes. J Med Chem52:6201-4 (2009) 
 
Sodium/glucose cotransporter 2
Name:Sodium/glucose cotransporter 2
Type:Protein
Mol. Mass.:72902.00
Organism:Homo sapiens (Human)
Description:P31639
Residue:672
BDBM50302614
NameBDBM50302614
Synonyms:(2R,3S,4S,5R)-2-(4-Chloro-3-(4-((S)-1-methylpyrrolidin-3-yloxy)benzyl)phenyl)-6-methoxytetrahydro-2H-pyran-3,4,5-triol | CHEMBL566484
TypeSmall organic molecule
Emp. Form.C24H30ClNO6
Mol. Mass.463.951
SMILESCOC1O[C@H]([C@H](O)[C@@H](O)[C@@H]1O)c1ccc(Cl)c(Cc2ccc(O[C@H]3CCN(C)C3)cc2)c1