Reaction Details
TargetSodium/glucose cotransporter 2
LigandBDBM50302620
Substrate/Competitorn/a
Meas. Tech.ChEMBL_594780 (CHEMBL1040741)
IC50 2400±n/a nM
Citation Goodwin, NCMabon, RHarrison, BAShadoan, MKAlmstead, ZYXie, YHealy, JBuhring, LMDaCosta, CMBardenhagen, JMseeh, FLiu, QNouraldeen, AWilson, AGKimball, SDPowell, DRRawlins, DB Novel L-xylose derivatives as selective sodium-dependent glucose cotransporter 2 (SGLT2) inhibitors for the treatment of type 2 diabetes. J Med Chem52:6201-4 (2009) 
 
Sodium/glucose cotransporter 2
Name:Sodium/glucose cotransporter 2
Type:Protein
Mol. Mass.:72902.00
Organism:Homo sapiens (Human)
Description:P31639
Residue:672
BDBM50302620
NameBDBM50302620
Synonyms:(2S,3R,4R,5S)-2-(4-Chloro-3-(4-ethoxyphenoxy)phenyl)-6-methoxytetrahydro-2H-pyran-3,4,5-triol | CHEMBL567373
TypeSmall organic molecule
Emp. Form.C20H23ClO7
Mol. Mass.410.845
SMILESCCOc1ccc(Oc2cc(ccc2Cl)[C@@H]2OC(OC)[C@@H](O)[C@H](O)[C@H]2O)cc1