Reaction Details
TargetSodium/glucose cotransporter 2
LigandBDBM50302605
Substrate/Competitorn/a
Meas. Tech.ChEMBL_594779 (CHEMBL1040740)
IC50 220±n/a nM
Citation Goodwin, NCMabon, RHarrison, BAShadoan, MKAlmstead, ZYXie, YHealy, JBuhring, LMDaCosta, CMBardenhagen, JMseeh, FLiu, QNouraldeen, AWilson, AGKimball, SDPowell, DRRawlins, DB Novel L-xylose derivatives as selective sodium-dependent glucose cotransporter 2 (SGLT2) inhibitors for the treatment of type 2 diabetes. J Med Chem52:6201-4 (2009) 
 
Sodium/glucose cotransporter 2
Name:Sodium/glucose cotransporter 2
Type:Protein
Mol. Mass.:73014.31
Organism:Mus musculus (Mouse)
Description:Q923I7
Residue:670
BDBM50302605
NameBDBM50302605
Synonyms:(2S,3R,4R,5S)-2-(4-Chloro-3-(4-ethoxybenzyl)phenyl)-6-methoxy-2-methyltetrahydro-2Hpyran-3,4,5-triol | CHEMBL583016
TypeSmall organic molecule
Emp. Form.C22H27ClO6
Mol. Mass.422.899
SMILESCCOc1ccc(Cc2cc(ccc2Cl)[C@]2(C)OC(OC)[C@@H](O)[C@H](O)[C@H]2O)cc1