Reaction Details
TargetSodium/glucose cotransporter 2
LigandBDBM50302606
Substrate/Competitorn/a
Meas. Tech.ChEMBL_594779 (CHEMBL1040740)
IC50 220±n/a nM
Citation Goodwin, NCMabon, RHarrison, BAShadoan, MKAlmstead, ZYXie, YHealy, JBuhring, LMDaCosta, CMBardenhagen, JMseeh, FLiu, QNouraldeen, AWilson, AGKimball, SDPowell, DRRawlins, DB Novel L-xylose derivatives as selective sodium-dependent glucose cotransporter 2 (SGLT2) inhibitors for the treatment of type 2 diabetes. J Med Chem52:6201-4 (2009) 
 
Sodium/glucose cotransporter 2
Name:Sodium/glucose cotransporter 2
Type:Protein
Mol. Mass.:73014.31
Organism:Mus musculus (Mouse)
Description:Q923I7
Residue:670
BDBM50302606
NameBDBM50302606
Synonyms:(2S,3R,4R,5R)-2-[4-Chloro-3-(4-ethoxy-benzyl)-phenyl]-5-fluoro-6-methoxy-tetrahydro-pyran-3,4-diol | CHEMBL566940
TypeSmall organic molecule
Emp. Form.C21H24ClFO5
Mol. Mass.410.864
SMILESCCOc1ccc(Cc2cc(ccc2Cl)[C@@H]2OC(OC)[C@H](F)[C@H](O)[C@H]2O)cc1