Reaction Details
TargetSodium/glucose cotransporter 2
LigandBDBM50302608
Substrate/Competitorn/a
Meas. Tech.ChEMBL_594779 (CHEMBL1040740)
IC50 330±n/a nM
Citation Goodwin, NCMabon, RHarrison, BAShadoan, MKAlmstead, ZYXie, YHealy, JBuhring, LMDaCosta, CMBardenhagen, JMseeh, FLiu, QNouraldeen, AWilson, AGKimball, SDPowell, DRRawlins, DB Novel L-xylose derivatives as selective sodium-dependent glucose cotransporter 2 (SGLT2) inhibitors for the treatment of type 2 diabetes. J Med Chem52:6201-4 (2009) 
 
Sodium/glucose cotransporter 2
Name:Sodium/glucose cotransporter 2
Type:Protein
Mol. Mass.:73014.31
Organism:Mus musculus (Mouse)
Description:Q923I7
Residue:670
BDBM50302608
NameBDBM50302608
Synonyms:(3S,4R,5R,6S)-2-(benzyloxy)-6-(4-chloro-3-(4-ethoxybenzyl)phenyl)tetrahydro-2H-pyran-3,4,5-triol | CHEMBL567778
TypeSmall organic molecule
Emp. Form.C27H29ClO6
Mol. Mass.484.969
SMILESCCOc1ccc(Cc2cc(ccc2Cl)[C@@H]2OC(OCc3ccccc3)[C@@H](O)[C@H](O)[C@H]2O)cc1