Reaction Details
TargetSodium/glucose cotransporter 2
LigandBDBM50302612
Substrate/Competitorn/a
Meas. Tech.ChEMBL_594779 (CHEMBL1040740)
IC50 330±n/a nM
Citation Goodwin, NCMabon, RHarrison, BAShadoan, MKAlmstead, ZYXie, YHealy, JBuhring, LMDaCosta, CMBardenhagen, JMseeh, FLiu, QNouraldeen, AWilson, AGKimball, SDPowell, DRRawlins, DB Novel L-xylose derivatives as selective sodium-dependent glucose cotransporter 2 (SGLT2) inhibitors for the treatment of type 2 diabetes. J Med Chem52:6201-4 (2009) 
 
Sodium/glucose cotransporter 2
Name:Sodium/glucose cotransporter 2
Type:Protein
Mol. Mass.:73014.31
Organism:Mus musculus (Mouse)
Description:Q923I7
Residue:670
BDBM50302612
NameBDBM50302612
Synonyms:CHEMBL568609 | O-4-(2-Chloro-5-((2S,3R,4R,5S)-3,4,5-trihydroxy-6-methoxytetrahydro-2H-pyran-2-yl)benzyl)phenyl dimethylcarbamothioate
TypeSmall organic molecule
Emp. Form.C22H26ClNO6S
Mol. Mass.467.963
SMILESCOC1O[C@H]([C@H](O)[C@@H](O)[C@@H]1O)c1ccc(Cl)c(Cc2ccc(OC(=S)N(C)C)cc2)c1