Reaction Details
TargetProstaglandin D2 receptor 2
LigandBDBM50302823
Substrate/Competitorn/a
Meas. Tech.ChEMBL_595293 (CHEMBL1047087)
IC50 2±n/a nM
Citation Liu, JFu, ZWang, YSchmitt, MHuang, AMarshall, DTonn, GSeitz, LSullivan, TLucy Tang, HCollins, TMedina, J Discovery and optimization of CRTH2 and DP dual antagonists. Bioorg Med Chem Lett19:6419-23 (2009) 
 
Prostaglandin D2 receptor 2
Name:Prostaglandin D2 receptor 2
Type:Enzyme
Mol. Mass.:43295.45
Organism:Homo sapiens (Human)
Description:Q9Y5Y4
Residue:395
BDBM50302823
NameBDBM50302823
Synonyms:2-(4-(2-(2,4-dichlorophenylsulfonamido)-4-(ethylcarbamoyl)phenoxy)-3-ethoxyphenyl)acetic acid | CHEMBL569719
TypeSmall organic molecule
Emp. Form.C25H24Cl2N2O7S
Mol. Mass.567.438
SMILESCCNC(=O)c1ccc(Oc2ccc(CC(O)=O)cc2OCC)c(NS(=O)(=O)c2ccc(Cl)cc2Cl)c1