Reaction Details
TargetCarbonic anhydrase 1
LigandBDBM50303032
Substrate/Competitorn/a
Meas. Tech.ChEMBL_597000 (CHEMBL1039096)
Ki 410±n/a nM
Citation Steele, RMBenedini, FBiondi, SBorghi, VCarzaniga, LImpagnatiello, FMiglietta, DChong, WKRajapakse, RCecchi, ATemperini, CSupuran, CT Nitric oxide-donating carbonic anhydrase inhibitors for the treatment of open-angle glaucoma. Bioorg Med Chem Lett19:6565-70 (2009) 
 
Carbonic anhydrase 1
Name:Carbonic anhydrase 1
Type:Enzyme
Mol. Mass.:28873.37
Organism:Homo sapiens (Human)
Description:P00915
Residue:261
BDBM50303032
NameBDBM50303032
Synonyms:CHEMBL584939 | Ethyl-((4S,6S)-6-methyl-7,7-dioxo-2-sulfamoyl-4,5,6,7-tetrahydro-7lambda*6*-thieno[2,3-b]thiopyran-4-yl)-carbamic acid 3-nitrooxy-propyl ester
TypeSmall organic molecule
Emp. Form.C14H21N3O9S3
Mol. Mass.471.526
SMILESCCN([C@H]1C[C@H](C)S(=O)(=O)c2sc(cc12)S(N)(=O)=O)C(=O)OCCCO[N+]([O-])=O