Reaction Details
TargetCarbonic anhydrase 4
LigandBDBM50303030
Substrate/Competitorn/a
Meas. Tech.ChEMBL_597002 (CHEMBL1041846)
Ki 4360±n/a nM
Citation Steele, RMBenedini, FBiondi, SBorghi, VCarzaniga, LImpagnatiello, FMiglietta, DChong, WKRajapakse, RCecchi, ATemperini, CSupuran, CT Nitric oxide-donating carbonic anhydrase inhibitors for the treatment of open-angle glaucoma. Bioorg Med Chem Lett19:6565-70 (2009) 
 
Carbonic anhydrase 4
Name:Carbonic anhydrase 4
Type:Enzyme
Mol. Mass.:35037.98
Organism:Homo sapiens (Human)
Description:P22748
Residue:312
BDBM50303030
NameBDBM50303030
Synonyms:6-Nitrooxy-hexanoic acid ethyl-((4S,6S)-6-methyl-7,7-dioxo-2-sulfamoyl-4,5,6,7-tetrahydro-7lambda*6*-thieno[2,3-b]thiopyran-4-yl)-amide | CHEMBL568854
TypeSmall organic molecule
Emp. Form.C16H25N3O8S3
Mol. Mass.483.58
SMILESCCN([C@H]1C[C@H](C)S(=O)(=O)c2sc(cc12)S(N)(=O)=O)C(=O)CCCCCO[N+]([O-])=O