Reaction Details
TargetTyrosine-protein kinase JAK2
LigandBDBM50303074
Substrate/Competitorn/a
Meas. Tech.ChEMBL_597287 (CHEMBL1044318)
IC50 0.6±n/a nM
Citation Ledeboer, MWPierce, ACDuffy, JPGao, HMessersmith, DSalituro, FGNanthakumar, SCome, JZuccola, HJSwenson, LShlyakter, DMahajan, SHoock, TFan, BTsai, WJKolaczkowski, ECarrier, SHogan, JKZessis, RPazhanisamy, SBennani, YL 2-Aminopyrazolo[1,5-a]pyrimidines as potent and selective inhibitors of JAK2. Bioorg Med Chem Lett19:6529-33 (2009) 
 
Tyrosine-protein kinase JAK2
Name:Tyrosine-protein kinase JAK2
Type:Protein
Mol. Mass.:130684.68
Organism:Homo sapiens (Human)
Description:O60674
Residue:1132
BDBM50303074
NameBDBM50303074
Synonyms:(R)-3-(6-(1-(4-fluorophenyl)propylamino)pyrimidin-4-yl)pyrazolo[1,5-a]pyrimidin-2-amine | CHEMBL569966
TypeSmall organic molecule
Emp. Form.C19H18FN7
Mol. Mass.363.3915
SMILESCC[C@@H](Nc1cc(ncn1)-c1c(N)nn2cccnc12)c1ccc(F)cc1