Reaction Details
TargetTyrosine-protein kinase JAK2
LigandBDBM50378535
Substrate/Competitorn/a
Meas. Tech.ChEMBL_597289 (CHEMBL1044320)
IC50>20000±n/a nM
Citation Ledeboer, MWPierce, ACDuffy, JPGao, HMessersmith, DSalituro, FGNanthakumar, SCome, JZuccola, HJSwenson, LShlyakter, DMahajan, SHoock, TFan, BTsai, WJKolaczkowski, ECarrier, SHogan, JKZessis, RPazhanisamy, SBennani, YL 2-Aminopyrazolo[1,5-a]pyrimidines as potent and selective inhibitors of JAK2. Bioorg Med Chem Lett19:6529-33 (2009) 
 
Tyrosine-protein kinase JAK2
Name:Tyrosine-protein kinase JAK2
Type:Protein
Mol. Mass.:130684.68
Organism:Homo sapiens (Human)
Description:O60674
Residue:1132
BDBM50378535
NameBDBM50378535
Synonyms:CHEMBL1204012
TypeSmall organic molecule
Emp. Form.C20H26N8O
Mol. Mass.394.4734
SMILESCCN(CC)C(=O)C1CCCN(C1)c1cc(ncn1)-c1c(N)nn2cccnc12