Reaction Details
TargetSodium-dependent serotonin transporter
LigandBDBM50303312
Substrate/Competitorn/a
Meas. Tech.ChEMBL_595537 (CHEMBL1048772)
Ki 0.061±n/a nM
Citation Kaur, HIzenwasser, SVerma, AWade, DHousman, AStevens, EDMobley, DLTrudell, ML Synthesis and monoamine transporter affinity of 3alpha-arylmethoxy-3beta-arylnortropanes. Bioorg Med Chem Lett19:6865-8 (2009) 
 
Sodium-dependent serotonin transporter
Name:Sodium-dependent serotonin transporter
Type:Multi-pass membrane protein
Mol. Mass.:70168.43
Organism:Rattus norvegicus (rat)
Description:P31652
Residue:630
BDBM50303312
NameBDBM50303312
Synonyms:3-alpha-(4-Dichlorophenyl)methoxy-3-beta-phenyl-nortropane | CHEMBL585282
TypeSmall organic molecule
Emp. Form.C20H21Cl2NO
Mol. Mass.362.293
SMILESClc1ccc(COC2(CC3CCC(C2)N3)c2ccccc2)cc1Cl