Reaction Details
TargetTransporter
LigandBDBM50303307
Substrate/Competitorn/a
Meas. Tech.ChEMBL_595538 (CHEMBL1048773)
Ki 120±n/a nM
Citation Kaur, HIzenwasser, SVerma, AWade, DHousman, AStevens, EDMobley, DLTrudell, ML Synthesis and monoamine transporter affinity of 3alpha-arylmethoxy-3beta-arylnortropanes. Bioorg Med Chem Lett19:6865-8 (2009) 
 
Transporter
Name:Transporter
Type:Multi-pass membrane protein
Mol. Mass.:69236.90
Organism:Rattus norvegicus (rat)
Description:Q63380
Residue:617
BDBM50303307
NameBDBM50303307
Synonyms:3-(4-Chlorophenyl)-2-nortropene | CHEMBL576508
TypeSmall organic molecule
Emp. Form.C13H14ClN
Mol. Mass.219.71
SMILESClc1ccc(cc1)C1=CC2CCC(C1)N2