Reaction Details
TargetTransporter
LigandBDBM50303309
Substrate/Competitorn/a
Meas. Tech.ChEMBL_595538 (CHEMBL1048773)
Ki 20±n/a nM
Citation Kaur, HIzenwasser, SVerma, AWade, DHousman, AStevens, EDMobley, DLTrudell, ML Synthesis and monoamine transporter affinity of 3alpha-arylmethoxy-3beta-arylnortropanes. Bioorg Med Chem Lett19:6865-8 (2009) 
 
Transporter
Name:Transporter
Type:Multi-pass membrane protein
Mol. Mass.:69236.90
Organism:Rattus norvegicus (rat)
Description:Q63380
Residue:617
BDBM50303309
NameBDBM50303309
Synonyms:3-(3,4-dichlorophenyl)-2-nortropene | CHEMBL578130
TypeSmall organic molecule
Emp. Form.C13H13Cl2N
Mol. Mass.254.155
SMILESClc1ccc(cc1Cl)C1=CC2CCC(C1)N2