Reaction Details
TargetG-protein coupled bile acid receptor 1
LigandBDBM23208
Substrate/Competitorn/a
Meas. Tech.ChEMBL_595939 (CHEMBL1041788)
EC50 1040±n/a nM
Citation Genet, CStrehle, ASchmidt, CBoudjelal, GLobstein, ASchoonjans, KSouchet, MAuwerx, JSaladin, RWagner, A Structure-activity relationship study of betulinic acid, a novel and selective TGR5 agonist, and its synthetic derivatives: potential impact in diabetes. J Med Chem53:178-90 (2010) 
 
G-protein coupled bile acid receptor 1
Name:G-protein coupled bile acid receptor 1
Type:G Protein-Coupled Receptor (GPCR)
Mol. Mass.:35260.02
Organism:Homo sapiens (Human)
Description:CHO cells transiently transfected with hTGR5.
Residue:330
BDBM23208
NameBDBM23208
Synonyms:(1R,2R,5S,8R,9R,10R,13R,14R,17S,19R)-17-hydroxy-1,2,14,18,18-pentamethyl-8-(prop-1-en-2-yl)pentacyclo[11.8.0.0^{2,10}.0^{5,9}.0^{14,19}]henicosane-5-carboxylic acid CHEMBL269277 | cid_64971
TypeTerpene
Emp. Form.C30H48O3
Mol. Mass.456.7003
SMILES[H][C@]12[C@@H](CC[C@@]1(CC[C@]1(C)[C@]2([H])CC[C@]2([H])[C@@]3(C)CC[C@H](O)C(C)(C)[C@]3([H])CC[C@@]12C)C(O)=O)C(C)=C