Reaction Details
TargetCarbonic anhydrase 13
LigandBDBM50303499
Substrate/Competitorn/a
Meas. Tech.ChEMBL_595959 (CHEMBL1044461)
Ki 8900±n/a nM
Citation Maresca, ATemperini, CPochet, LMasereel, BScozzafava, ASupuran, CT Deciphering the mechanism of carbonic anhydrase inhibition with coumarins and thiocoumarins. J Med Chem53:335-44 (2010) 
 
Carbonic anhydrase 13
Name:Carbonic anhydrase 13
Type:Enzyme
Mol. Mass.:29522.80
Organism:Mus musculus (mouse)
Description:Murine cloned isozyme
Residue:262
BDBM50303499
NameBDBM50303499
Synonyms:7-(methyloxy)-2H-chromen-2-one 7-methoxy-2H-1-benzopyran-2-one CHEMBL49732 Herniarine | Methylumbelliferone
TypeSmall organic molecule
Emp. Form.C10H8O3
Mol. Mass.176.1687
SMILESCOc1ccc2ccc(=O)oc2c1