Reaction Details
TargetCarbonic anhydrase 13
LigandBDBM50303501
Substrate/Competitorn/a
Meas. Tech.ChEMBL_595959 (CHEMBL1044461)
Ki 6600±n/a nM
Citation Maresca, ATemperini, CPochet, LMasereel, BScozzafava, ASupuran, CT Deciphering the mechanism of carbonic anhydrase inhibition with coumarins and thiocoumarins. J Med Chem53:335-44 (2010) 
 
Carbonic anhydrase 13
Name:Carbonic anhydrase 13
Type:Enzyme
Mol. Mass.:29522.80
Organism:Mus musculus (mouse)
Description:Murine cloned isozyme
Residue:262
BDBM50303501
NameBDBM50303501
Synonyms:7-propoxy-2H-chromen-2-one | CHEMBL568516
TypeSmall organic molecule
Emp. Form.C12H12O3
Mol. Mass.204.2219
SMILESCCCOc1ccc2ccc(=O)oc2c1