Reaction Details
TargetCarbonic anhydrase 13
LigandBDBM50303488
Substrate/Competitorn/a
Meas. Tech.ChEMBL_595959 (CHEMBL1044461)
Ki 6900±n/a nM
Citation Maresca, ATemperini, CPochet, LMasereel, BScozzafava, ASupuran, CT Deciphering the mechanism of carbonic anhydrase inhibition with coumarins and thiocoumarins. J Med Chem53:335-44 (2010) 
 
Carbonic anhydrase 13
Name:Carbonic anhydrase 13
Type:Enzyme
Mol. Mass.:29522.80
Organism:Mus musculus (mouse)
Description:Murine cloned isozyme
Residue:262
BDBM50303488
NameBDBM50303488
Synonyms:6-methyl-2-oxo-2H-chromene-3-carboxylic acid | CHEMBL577123
TypeSmall organic molecule
Emp. Form.C11H8O4
Mol. Mass.204.1788
SMILESCc1ccc2oc(=O)c(cc2c1)C(O)=O