Reaction Details
TargetCarbonic anhydrase 13
LigandBDBM50303490
Substrate/Competitorn/a
Meas. Tech.ChEMBL_595959 (CHEMBL1044461)
Ki 3100±n/a nM
Citation Maresca, ATemperini, CPochet, LMasereel, BScozzafava, ASupuran, CT Deciphering the mechanism of carbonic anhydrase inhibition with coumarins and thiocoumarins. J Med Chem53:335-44 (2010) 
 
Carbonic anhydrase 13
Name:Carbonic anhydrase 13
Type:Enzyme
Mol. Mass.:29522.80
Organism:Mus musculus (mouse)
Description:Murine cloned isozyme
Residue:262
BDBM50303490
NameBDBM50303490
Synonyms:6-(hydroxymethyl)-2-oxo-2H-chromene-3-carboxylic acid | CHEMBL568417
TypeSmall organic molecule
Emp. Form.C11H8O5
Mol. Mass.220.1782
SMILESOCc1ccc2oc(=O)c(cc2c1)C(O)=O