Reaction Details
TargetCarbonic anhydrase 13
LigandBDBM50303495
Substrate/Competitorn/a
Meas. Tech.ChEMBL_595959 (CHEMBL1044461)
Ki 45±n/a nM
Citation Maresca, ATemperini, CPochet, LMasereel, BScozzafava, ASupuran, CT Deciphering the mechanism of carbonic anhydrase inhibition with coumarins and thiocoumarins. J Med Chem53:335-44 (2010) 
 
Carbonic anhydrase 13
Name:Carbonic anhydrase 13
Type:Enzyme
Mol. Mass.:29522.80
Organism:Mus musculus (mouse)
Description:Murine cloned isozyme
Residue:262
BDBM50303495
NameBDBM50303495
Synonyms:CHEMBL568385 | ethyl 7-methoxy-2-oxo-2H-chromene-3-carboxylate
TypeSmall organic molecule
Emp. Form.C13H12O5
Mol. Mass.248.2314
SMILESCCOC(=O)c1cc2ccc(OC)cc2oc1=O