Reaction Details
TargetCarbonic anhydrase 14
LigandBDBM50303492
Substrate/Competitorn/a
Meas. Tech.ChEMBL_595960 (CHEMBL1044462)
Ki 7800±n/a nM
Citation Maresca, ATemperini, CPochet, LMasereel, BScozzafava, ASupuran, CT Deciphering the mechanism of carbonic anhydrase inhibition with coumarins and thiocoumarins. J Med Chem53:335-44 (2010) 
 
Carbonic anhydrase 14
Name:Carbonic anhydrase 14
Type:Enzyme
Mol. Mass.:37665.67
Organism:Homo sapiens (Human)
Description:Human (cloned) isozyme.
Residue:337
BDBM50303492
NameBDBM50303492
Synonyms:2-oxo-2H-thiochromene-3-carboxylic acid | CHEMBL571519
TypeSmall organic molecule
Emp. Form.C10H6O3S
Mol. Mass.206.218
SMILESOC(=O)c1cc2ccccc2sc1=O