Reaction Details
TargetCarbonic anhydrase 14
LigandBDBM50303494
Substrate/Competitorn/a
Meas. Tech.ChEMBL_595960 (CHEMBL1044462)
Ki 41±n/a nM
Citation Maresca, ATemperini, CPochet, LMasereel, BScozzafava, ASupuran, CT Deciphering the mechanism of carbonic anhydrase inhibition with coumarins and thiocoumarins. J Med Chem53:335-44 (2010) 
 
Carbonic anhydrase 14
Name:Carbonic anhydrase 14
Type:Enzyme
Mol. Mass.:37665.67
Organism:Homo sapiens (Human)
Description:Human (cloned) isozyme.
Residue:337
BDBM50303494
NameBDBM50303494
Synonyms:CHEMBL568173 | ethyl 6-(hydroxymethyl)-2-oxo-2H-chromene-3-carboxylate
TypeSmall organic molecule
Emp. Form.C13H12O5
Mol. Mass.248.2314
SMILESCCOC(=O)c1cc2cc(CO)ccc2oc1=O