Reaction Details
TargetCarbonic anhydrase 15
LigandBDBM50303500
Substrate/Competitorn/a
Meas. Tech.ChEMBL_595961 (CHEMBL1044463)
Ki 1000±n/a nM
Citation Maresca, ATemperini, CPochet, LMasereel, BScozzafava, ASupuran, CT Deciphering the mechanism of carbonic anhydrase inhibition with coumarins and thiocoumarins. J Med Chem53:335-44 (2010) 
 
Carbonic anhydrase 15
Name:Carbonic anhydrase 15
Type:PROTEIN
Mol. Mass.:35484.02
Organism:Mus musculus
Description:ChEMBL_651955
Residue:324
BDBM50303500
NameBDBM50303500
Synonyms:7-ethoxy-2H-1-benzopyran-2-one CHEMBL191528 | Ethylumbelliferone
TypeSmall organic molecule
Emp. Form.C11H10O3
Mol. Mass.190.1953
SMILESCCOc1ccc2ccc(=O)oc2c1