Reaction Details
TargetCarbonic anhydrase 15
LigandBDBM50378564
Substrate/Competitorn/a
Meas. Tech.ChEMBL_595961 (CHEMBL1044463)
Ki 4600±n/a nM
Citation Maresca, ATemperini, CPochet, LMasereel, BScozzafava, ASupuran, CT Deciphering the mechanism of carbonic anhydrase inhibition with coumarins and thiocoumarins. J Med Chem53:335-44 (2010) 
 
Carbonic anhydrase 15
Name:Carbonic anhydrase 15
Type:PROTEIN
Mol. Mass.:35484.02
Organism:Mus musculus
Description:ChEMBL_651955
Residue:324
BDBM50378564
NameBDBM50378564
Synonyms:CHEMBL145781
TypeSmall organic molecule
Emp. Form.C16H12O3
Mol. Mass.252.2647
SMILESO=c1ccc2ccc(OCc3ccccc3)cc2o1