Reaction Details
TargetCarbonic anhydrase 15
LigandBDBM50303492
Substrate/Competitorn/a
Meas. Tech.ChEMBL_595961 (CHEMBL1044463)
Ki 4800±n/a nM
Citation Maresca, ATemperini, CPochet, LMasereel, BScozzafava, ASupuran, CT Deciphering the mechanism of carbonic anhydrase inhibition with coumarins and thiocoumarins. J Med Chem53:335-44 (2010) 
 
Carbonic anhydrase 15
Name:Carbonic anhydrase 15
Type:PROTEIN
Mol. Mass.:35484.02
Organism:Mus musculus
Description:ChEMBL_651955
Residue:324
BDBM50303492
NameBDBM50303492
Synonyms:2-oxo-2H-thiochromene-3-carboxylic acid | CHEMBL571519
TypeSmall organic molecule
Emp. Form.C10H6O3S
Mol. Mass.206.218
SMILESOC(=O)c1cc2ccccc2sc1=O