Reaction Details
TargetCarbonic anhydrase 3
LigandBDBM50303493
Substrate/Competitorn/a
Meas. Tech.ChEMBL_595951 (CHEMBL1044453)
Ki 48600±n/a nM
Citation Maresca, ATemperini, CPochet, LMasereel, BScozzafava, ASupuran, CT Deciphering the mechanism of carbonic anhydrase inhibition with coumarins and thiocoumarins. J Med Chem53:335-44 (2010) 
 
Carbonic anhydrase 3
Name:Carbonic anhydrase 3
Type:Enzyme
Mol. Mass.:29562.11
Organism:Homo sapiens (Human)
Description:Human cloned isozyme.
Residue:260
BDBM50303493
NameBDBM50303493
Synonyms:CHEMBL567896 | methyl 6-(hydroxymethyl)-2-oxo-2H-chromene-3-carboxylate
TypeSmall organic molecule
Emp. Form.C12H10O5
Mol. Mass.234.2048
SMILESCOC(=O)c1cc2cc(CO)ccc2oc1=O