Reaction Details
TargetCarbonic anhydrase 3
LigandBDBM50303502
Substrate/Competitorn/a
Meas. Tech.ChEMBL_595951 (CHEMBL1044453)
Ki 7300±n/a nM
Citation Maresca, ATemperini, CPochet, LMasereel, BScozzafava, ASupuran, CT Deciphering the mechanism of carbonic anhydrase inhibition with coumarins and thiocoumarins. J Med Chem53:335-44 (2010) 
 
Carbonic anhydrase 3
Name:Carbonic anhydrase 3
Type:Enzyme
Mol. Mass.:29562.11
Organism:Homo sapiens (Human)
Description:Human cloned isozyme.
Residue:260
BDBM50303502
NameBDBM50303502
Synonyms:7-butoxy-2H-chromen-2-one | CHEMBL571514
TypeSmall organic molecule
Emp. Form.C13H14O3
Mol. Mass.218.2485
SMILESCCCCOc1ccc2ccc(=O)oc2c1