Reaction Details
TargetCarbonic anhydrase 2
LigandBDBM50300203
Substrate/Competitorn/a
Meas. Tech.ChEMBL_595950 (CHEMBL1041799)
Ki 42500±n/a nM
Citation Maresca, ATemperini, CPochet, LMasereel, BScozzafava, ASupuran, CT Deciphering the mechanism of carbonic anhydrase inhibition with coumarins and thiocoumarins. J Med Chem53:335-44 (2010) 
 
Carbonic anhydrase 2
Name:Carbonic anhydrase 2
Type:Enzyme
Mol. Mass.:29250.71
Organism:Homo sapiens (Human)
Description:P00918
Residue:260
BDBM50300203
NameBDBM50300203
Synonyms:(S)-6-(1-hydroxy-3-methylbutyl)-7-methoxy-2H-chromen-2-one CHEMBL572366
TypeSmall organic molecule
Emp. Form.C15H18O4
Mol. Mass.262.301
SMILESCOc1cc2oc(=O)ccc2cc1[C@@H](O)CC(C)C