Reaction Details
TargetCarbonic anhydrase 1
LigandBDBM50303500
Substrate/Competitorn/a
Meas. Tech.ChEMBL_595949 (CHEMBL1041798)
Ki 31400±n/a nM
Citation Maresca, ATemperini, CPochet, LMasereel, BScozzafava, ASupuran, CT Deciphering the mechanism of carbonic anhydrase inhibition with coumarins and thiocoumarins. J Med Chem53:335-44 (2010) 
 
Carbonic anhydrase 1
Name:Carbonic anhydrase 1
Type:Enzyme
Mol. Mass.:28873.37
Organism:Homo sapiens (Human)
Description:P00915
Residue:261
BDBM50303500
NameBDBM50303500
Synonyms:7-ethoxy-2H-1-benzopyran-2-one CHEMBL191528 | Ethylumbelliferone
TypeSmall organic molecule
Emp. Form.C11H10O3
Mol. Mass.190.1953
SMILESCCOc1ccc2ccc(=O)oc2c1