Reaction Details
TargetCarbonic anhydrase 9
LigandBDBM50303496
Substrate/Competitorn/a
Meas. Tech.ChEMBL_595957 (CHEMBL1044459)
Ki 8400±n/a nM
Citation Maresca, ATemperini, CPochet, LMasereel, BScozzafava, ASupuran, CT Deciphering the mechanism of carbonic anhydrase inhibition with coumarins and thiocoumarins. J Med Chem53:335-44 (2010) 
 
Carbonic anhydrase 9
Name:Carbonic anhydrase 9
Type:Enzyme
Mol. Mass.:49669.03
Organism:Homo sapiens (Human)
Description:Catalytic domain of human cloned isozyme was used in the assay
Residue:459
BDBM50303496
NameBDBM50303496
Synonyms:6-(hydroxymethyl)-2H-chromen-2-one | CHEMBL571738
TypeSmall organic molecule
Emp. Form.C10H8O3
Mol. Mass.176.1687
SMILESOCc1ccc2oc(=O)ccc2c1