Reaction Details
TargetCarbonic anhydrase 7
LigandBDBM50303497
Substrate/Competitorn/a
Meas. Tech.ChEMBL_595956 (CHEMBL1044458)
Ki 9000±n/a nM
Citation Maresca, ATemperini, CPochet, LMasereel, BScozzafava, ASupuran, CT Deciphering the mechanism of carbonic anhydrase inhibition with coumarins and thiocoumarins. J Med Chem53:335-44 (2010) 
 
Carbonic anhydrase 7
Name:Carbonic anhydrase 7
Type:Enzyme
Mol. Mass.:29664.11
Organism:Homo sapiens (Human)
Description:Human cloned isozyme.
Residue:264
BDBM50303497
NameBDBM50303497
Synonyms:6-(aminomethyl)-2H-chromen-2-one | CHEMBL567139
TypeSmall organic molecule
Emp. Form.C10H9NO2
Mol. Mass.175.184
SMILESNCc1ccc2oc(=O)ccc2c1