Reaction Details
TargetCarbonic anhydrase 7
LigandBDBM50303491
Substrate/Competitorn/a
Meas. Tech.ChEMBL_595956 (CHEMBL1044458)
Ki 32400±n/a nM
Citation Maresca, ATemperini, CPochet, LMasereel, BScozzafava, ASupuran, CT Deciphering the mechanism of carbonic anhydrase inhibition with coumarins and thiocoumarins. J Med Chem53:335-44 (2010) 
 
Carbonic anhydrase 7
Name:Carbonic anhydrase 7
Type:Enzyme
Mol. Mass.:29664.11
Organism:Homo sapiens (Human)
Description:Human cloned isozyme.
Residue:264
BDBM50303491
NameBDBM50303491
Synonyms:8-methoxy-2-oxo-2H-chromene-3-carboxylic acid | CHEMBL568348
TypeSmall organic molecule
Emp. Form.C11H8O5
Mol. Mass.220.1782
SMILESCOc1cccc2cc(C(O)=O)c(=O)oc12