Reaction Details
TargetCarbonic anhydrase 7
LigandBDBM50303502
Substrate/Competitorn/a
Meas. Tech.ChEMBL_595956 (CHEMBL1044458)
Ki 4100±n/a nM
Citation Maresca, ATemperini, CPochet, LMasereel, BScozzafava, ASupuran, CT Deciphering the mechanism of carbonic anhydrase inhibition with coumarins and thiocoumarins. J Med Chem53:335-44 (2010) 
 
Carbonic anhydrase 7
Name:Carbonic anhydrase 7
Type:Enzyme
Mol. Mass.:29664.11
Organism:Homo sapiens (Human)
Description:Human cloned isozyme.
Residue:264
BDBM50303502
NameBDBM50303502
Synonyms:7-butoxy-2H-chromen-2-one | CHEMBL571514
TypeSmall organic molecule
Emp. Form.C13H14O3
Mol. Mass.218.2485
SMILESCCCCOc1ccc2ccc(=O)oc2c1